نبردناو
scope note: نوعی کشتی جنگی بزرگ با زره ضخیم که دارای توپخانه‌ای با بزرگ‌ترین قطرینۀ (calibre) توپ است.
broader: ناو جنگی
preferred label: battle ship @en
type: Concept

ناو جنگی
preferred label: armed naval ship @en
type: Concept
narrower: نبردناو