کشتی فریبگر
scope note: نوعی کشتی یا ناو استتارشده، با انواع سلاح‌ها و تجهیزات جنگی، که به‌صورت یک کشتی غیررزمی ظاهر می‌شود و به‌سرعت می‌تواند به‌صورت ناو جنگی وارد عملیات شود.
broader: ناو جنگی
preferred label: decoy ship @en
type: Concept

ناو جنگی
preferred label: armed naval ship @en
type: Concept
narrower: کشتی فریبگر