ناو تدارکاتی
scope note: ناوی که کارکنان یا اقلام ضروری را جابه‌جا می‌کند.
broader: ناو جنگی
preferred label: supply ship @en
type: Concept

ناو جنگی
preferred label: armed naval ship @en
type: Concept
narrower: ناو تدارکاتی