کشتی بارگنجی
preferred label: containership @en
type: Concept
narrower: کشتی تمام‌بارگُنجی

کشتی تمام‌بارگُنجی
scope note: نوعی کشتی بارگُنجی که دارای محل‌هایی به ‌اندازۀ بارگُنج‌ها است و در آن دیگر نیازی به مهاربندی و جابه‌جایی بارگُنج‌ها نیست.
broader: کشتی بارگنجی
preferred label: cellular-container ship @en
type: Concept