کشتی بارگنجی
preferred label: containership @en
type: Concept
narrower: بارگنج‌ـ‌‌ دوبه‌بر

بارگنج‌ـ‌‌ دوبه‌بر
scope note: کشتی‌ای که برای حمل هم‌زمان دوبه و بارگُنج طراحی و ساخته شده است
broader: کشتی بارگنجی
preferred label: container barge carrier @en
type: Concept