کشتی بارگنجی
preferred label: containership @en
type: Concept
narrower: کشتی نیمه‌بارگنجی

کشتی نیمه‌بارگنجی
scope note: نوعی کشتی‌ برای حمل بارگُنج و کالاهای فله‌ای و نیم‌فله‌ای و کشتی‌های رورو
broader: کشتی بارگنجی
preferred label: semi-container ship @en
type: Concept