کشتی واسطه
scope note: کشتی‌هایی برای حمل کالاهای تخلیه‌شده از کشتی‌های بزرگ و اقیانوس‌پیما از بندری به بندر دیگر
broader: کشتی
preferred label: feeder ship @en
type: Concept

کشتی
preferred label: ship @en
type: Concept
narrower: کشتی واسطه