کشتی
preferred label: ship @en
type: Concept
narrower: کشتی بی‌جرثقیل

کشتی بی‌جرثقیل
scope note: هر کشتی که بر روی عرشه جرثقیل نداشته باشد و برای بارگیری و تخلیه از جرثقیل‌های اسکله استفاده کند.
broader: کشتی
preferred label: gearless ship @en
type: Concept