مین‌گذار
scope note: شناوری که ویژۀ مین‌گذاری طراحی و ساخته شده است.
broader: کشتی
preferred label: mine planter ship @en
type: Concept

کشتی
preferred label: ship @en
type: Concept
narrower: مین‌گذار