پسماند
preferred label: waste @en
type: Concept
narrower: پسماند ناسازگار

پسماند ناسازگار
scope note: پسماند خطرناکی که به‌‌خودیخود در محل یا در مجاورت یا اختلاط با مواد یا پسماندهای دیگر ممکن است واکنش دهد و اثرات نامطلوب بر جای گذارد.
broader: پسماند
preferred label: incompatible waste @en
type: Concept