پسماند پرتوزا
preferred label: radioactive waste @en
type: Concept
narrower: پسماند میان‏پرتو

پسماند میان‏پرتو
scope note: مواد زاید پرتوزای حاصل از فعالیت واکنشگاه‌ها/ رآکتورها که فعالیت متوسطی داشته باشند.
broader: پسماند پرتوزا
preferred label: mid level radioactive waste @en
type: Concept