پسماند
preferred label: waste @en
type: Concept
narrower: پسماند سمی

پسماند سمی
scope note: پسماندی که در صورت بلع یا استنشاق یا تماس با پوست به انسان یا هر موجود زندۀ دیگر آسیب می‌رساند.
broader: پسماند
preferred label: toxic waste @en
type: Concept