دفع دریایی
scope note: دفع مواد بی‌مصرف حاصل از پردازش پسماندها در دریا
broader: دفع پسماند
preferred label: marine disposal @en
type: Concept

دفع پسماند
preferred label: waste disposal @en
type: Concept
narrower: دفع دریایی