تصفیه پسماند
preferred label: waste treatment @en
type: Concept
narrower: سامانۀ تصفیه اقماری

سامانۀ تصفیه اقماری
alternative label: تصفیه در نقطۀ فروش
scope note: سامانۀ تصفیۀ غشایی کوچک‌مقیاسی که در آن فاضلاب‌های هر منطقه به‌طور جداگانه جمع‌آوری و تصفیه و برای بازمصرف عرضه می‌شود.
broader: تصفیه پسماند
preferred label: satellite treatment @en
type: Concept