تصفیه ثانویه
scope note: مرحلۀ دوم اکثر سامانه‏های تصفیۀ فاضلاب که در آن ازطریق تماس فاضلاب با اکسیژن، ریزاندامگان‌ها مواد آلی موجود در فاضلاب را مصرف می‏کنند.
broader: تصفیه فاضلاب
preferred label: secondary treatment @en
type: Concept

تصفیه فاضلاب
preferred label: wastewater treatment @en
type: Concept
narrower: تصفیه ثانویه