سانحه راه‌آهن
preferred label: railroad accident @en
type: Concept
narrower: خروج از خط

خروج از خط
scope note: خروج وسایل خط‌نورد به دلایلی از قبیل خرابی و اشتباه در عملکرد و عبور از روی واگن‌پران
broader: سانحه راه‌آهن
preferred label: derailment @en
type: Concept