ارابه فرود سه‌چرخ
scope note: ارابه فرودی که چرخ‌های اصلی چپ و راست آن عقب‌تر از مرکز ثقل هواگَرد و چرخ دماغه در جلوی آن است.
broader: ارابه فرود (هواگرد)
preferred label: tricycle landing gear @en
type: Concept

ارابه فرود (هواگرد)
preferred label: landing gear (aircraft) @en
type: Concept
narrower: ارابه فرود سه‌چرخ