نامیزه‌سازی
preferred label: emulsification @en
type: Concept
narrower: آزمون نامیزه‌سازی

آزمون نامیزه‌سازی
scope note: روش آزمایشگاهی معیار برای ارزیابی مقاومت روغن‌های عایق و روان‌کارها و دیگر روغن‌ها
broader: نامیزه‌سازی
preferred label: emulsification test @en
type: Concept