آمیختگی
preferred label: mixing @en
type: Concept
narrower: افشانه‌آمیزی

افشانه‌آمیزی
scope note: آمیختن مواد در خشک‌کن پاششی که در طی آن کلوخه شدن روی می‌دهد
broader: آمیختگی
preferred label: spray mixing @en
type: Concept