تغلیظ انجمادی
scope note: یکی از روش‌های تغلیظ مواد غذایی مایع که با جدایش آب به‌صورت یخ تشکیل‌شده در مایع انجام می‌شود.
broader: تغلیظ (فرایند)
preferred label: freeze concentration @en
type: Concept

تغلیظ (فرایند)
preferred label: concentration (process) @en
type: Concept
narrower: تغلیظ انجمادی