تقطیر هم‌جوش
scope note: تقطیری که در آن دو یا چند مادۀ هم‌جوش با افزودن مادۀ سوم از یکدیگر جدا می‌شوند.
broader: تقطیر
preferred label: azeotropic distillation @en
type: Concept

تقطیر
preferred label: distillation @en
type: Concept
narrower: تقطیر هم‌جوش