تقطیر
preferred label: distillation @en
type: Concept
narrower: تقطیر استخراجی

تقطیر استخراجی
scope note: فرایند تبخیر جزئی با استفاده از یک حلاّل امتزاج‌پذیر غیرفرّار دارای نقطۀ جوش بالا
broader: تقطیر
preferred label: extractive distillation @en
type: Concept