تقطیر
preferred label: distillation @en
type: Concept
narrower: تقطیر غشایی

تقطیر غشایی
scope note: نوعی فرایند تقطیر که در آن فازهای مایع و گاز با غشای متخلخل از هم جدا می‌شوند.
broader: تقطیر
preferred label: membrane distillation @en
type: Concept