تقطیر
preferred label: distillation @en
type: Concept
narrower: تقطیر مولکولی

تقطیر مولکولی
scope note: فرایند تقطیری که در آن مواد در خلأ زیاد و دمای کم تقطیر می‌شوند، بی‌آنکه صدمه‌ای به ترکیب آنها وارد شود.
broader: تقطیر
preferred label: molecular distillation @en
type: Concept