تقطیر چندجزئی
scope note: جدایش مایعی با بیش از سه جزء به روش تقطیر [مهندسی شیمی] تقطیر یک مخلوط چندجزئی برای تفکیک اجزای آن
broader: تقطیر
preferred label: multicomponent distillation @en
type: Concept

تقطیر
preferred label: distillation @en
type: Concept
narrower: تقطیر چندجزئی