تقطیر فشاری
scope note: فرایند تقطیری که در فشاری بیشتر از فشار جوّ انجام شود
broader: تقطیر
preferred label: pressure distillation @en
type: Concept

تقطیر
preferred label: distillation @en
type: Concept
narrower: تقطیر فشاری