تقطیر با بخار
scope note: تقطیری که در آن اجزای فرّار یک مخلوط مایع با ورود مستقیم بخار در دمایی پایین‌تر تبخیر می‌شوند.
broader: تقطیر
preferred label: steam distillation @en
type: Concept

تقطیر
preferred label: distillation @en
type: Concept
narrower: تقطیر با بخار