کوب‌جت توربینی
scope note: پیشرانه‌ای مرکب از توربین‌جت و کوب‌جت که در هواپیماهای اَبَرصوتی به‌کار می‌رود.
broader: کوب‌جت
preferred label: turbo-ramjet @en
type: Concept

کوب‌جت
preferred label: ramjet engine @en
type: Concept
narrower: کوب‌جت توربینی