برجذبش
preferred label: adsorption @en
type: Concept
narrower: برجذب دماتناوبی

برجذب دماتناوبی
scope note: روشی که در آن یک مادۀ جاذب، تحت دماهای متناوب، گازها را براساس برجذب و واجذبش چرخه‌ای جدا می‌کند.
broader: برجذبش
preferred label: temperature swing adsorption @en
type: Concept