هم‌بسپارش
preferred label: copolymerization @en
type: Concept
narrower: بسپارش چندجزئی

بسپارش چندجزئی
scope note: هم‌بسپارش سه یا چند تکپار که با چند واکنش انتشاری و پایانشی همراه است.
broader: هم‌بسپارش
preferred label: multicomponent polymerization @en
type: Concept