بسپارش
preferred label: polymerization @en
type: Concept
narrower: بسپارش پفکی

بسپارش پفکی
scope note: جدا شدن ذرات بسپار کوچک و غیرشفاف در ‌هنگام بسپارش رادیکالی
broader: بسپارش
preferred label: popcorn polymerization @en
type: Concept