پرنده هدایت‌پذیرازدور
alternative label: پهپاد
scope note: هواگَردِ موتوردار بدون سرنشینِ یک‌بارمصرف یا قابل‌بازیافت که با نیروهای آئرودینامیکی به‌صورت خودکار یا با واپایش از راه دور به پرواز درمی‌آید و برای حمل محموله‌های متعارف یا مرگبار به کار می‌رود.
broader: هواگرد نظامی
preferred label: unmanned aerial vehicle @en
type: Concept

هواگرد نظامی
preferred label: military aircraft @en
type: Concept
narrower: پرنده هدایت‌پذیرازدور