سوانگاری مایعی کارا
alternative label: سوانگاری مایعی با عملکرد بالا
scope note: نوعی سوانگاری مایعی که در آن فاز مایع به‌آسانی تغییر می‌کند و در قدرت تفکیک و زمان تجزیه اثر میگذارد.
broader: سوانگاری مایعی
preferred label: high performance liquid chromatography @en
type: Concept

سوانگاری مایعی
preferred label: liquid chromatography @en
type: Concept
narrower: سوانگاری مایعی کارا