رمزینه
preferred label: bar code @en
type: Concept
narrower: رمزینه پاسخ‌سریع

رمزینه پاسخ‌سریع
alternative label: رمزینه پاس
scope note: تصویر دوبعدی جدول‌مانندی که با تلفن‌های همراه هوشمند و پویشگرهای پاسخ‌سریع و دیگر افزاره‌های دستی خوانش‌پذیر است.
broader: رمزینه
preferred label: quick response code @en
type: Concept