ضریب انبساط سطحی
scope note: افزایش مساحت واحد سطح جسم براثر یک درجه افزایش دما در فشار ثابت
broader: ضریب انبساط
preferred label: coefficient of superficial expansion @en
type: Concept

ضریب انبساط
preferred label: coefficient of expansion @en
type: Concept
narrower: ضریب انبساط سطحی