بال پس‌گرا
scope note: بالی که لبۀ حمله آن نسبت به بدنه دارای زاویه‌ای روبه‌عقب است.
broader: بال
preferred label: sweptback wing @en
type: Concept

بال
preferred label: wing @en
type: Concept
narrower: بال پس‌گرا