میل‌بادامک مسابقه‌ای
scope note: میل‌بادامکی که منحنی بادامک آن را برای افزایش توان موتور تغییر داده‌اند.
broader: میل بادامک
preferred label: race camshaft @en
type: Concept

میل بادامک
preferred label: camshaft @en
type: Concept
narrower: میل‌بادامک مسابقه‌ای