محور میل‌لنگ
scope note: هریک از دو سر میل‌لنگ که یاتاقان‌های ثابت یا چرخ‌لنگر یا چرخ‌زنجیر یا چرخ‌تسمه بر روی آن نصب می‌شود.
broader: میل‌لنگ
preferred label: crankshaft axle @en
type: Concept

میل‌لنگ
preferred label: crankshaft @en
type: Concept
narrower: محور میل‌لنگ