چرخ‌تسمه میل‌لنگ
scope note: چرخ‌تسمه‌ای که به سر پیشین میل‌لنگ نصب می‌شود و اجزای مختلف موتور مانند پمپ آب و دینام و فرمان هیدرولیک را ازطریق تسمه به حرکت درمی‌آورد.
broader: میل‌لنگ
preferred label: crankshaft pulley @en
type: Concept

میل‌لنگ
preferred label: crankshaft @en
type: Concept
narrower: چرخ‌تسمه میل‌لنگ