میل‌لنگ
preferred label: crankshaft @en
type: Concept
narrower: میل‌لنگ بیش‌دامنه

میل‌لنگ بیش‌دامنه
scope note: میل‌لنگی که به‌دلیل بزرگ‌تر بودن بازوی لَنگ باعث افزایش دامنۀ جابه‌جایی پیستون در سیلندر می‌شود.
broader: میل‌لنگ
preferred label: stroked crankshaft @en
type: Concept