مقاومت
preferred label: resistor @en
type: Concept
narrower: مقاومت گدازپذیر

مقاومت گدازپذیر
scope note: قطعه‌ای با مقاومت اندک که براثر ذوب ‌شدن و قطع مدار، در برابر جریان‌های ناگهانی از وسیلۀ الکتریکی حفاظت می‌کند.
broader: مقاومت
preferred label: fusible resistor @en
type: Concept