تاج پیستون
scope note: بخشی از پیستون که در بالای رینگ تراکم قرار دارد.
broader: پیستون
preferred label: piston crown @en
type: Concept

پیستون
preferred label: piston @en
type: Concept
narrower: تاج پیستون