پایه انگشتی پیستون
scope note: برآمدگی دور حفرۀ انگشتی در داخل پیستون که انگشتی در آن قرار دارد.
broader: انگشتی پیستون
preferred label: piston pin boss @en
type: Concept

انگشتی پیستون
preferred label: piston pin @en
type: Concept
narrower: پایه انگشتی پیستون