سر کوچک دسته‌پیستون
preferred label: piston pin end @en
type: Concept
narrower: بوش سر کوچک دسته‌پیستون

بوش سر کوچک دسته‌پیستون
alternative label: بوش سر کوچک شاتون
scope note: بوشی که در محل اتصال سر کوچک دسته‌پیستون به انگشتی پیستون تعبیه می‌شود.
broader: سر کوچک دسته‌پیستون
preferred label: piston pin bushing @en
type: Concept