پیستون
preferred label: piston @en
type: Concept
narrower: رینگ‌خور پیستون

رینگ‌خور پیستون
alternative label: حلقه‌خور پیستون
scope note: بخشی از سطح خارجی پیستون در زیر تاج که شیارهای رینگ پیستون در آنجا قرار دارند.
broader: پیستون
preferred label: piston ring zone @en
type: Concept