تیر
preferred label: beam @en
type: Concept
narrower: تیر چنددهانه

تیر چنددهانه
scope note: تیری سراسری که تعداد تکیه‌گاه‌های آن یکی بیشتر از تعداد دهانه‌های آن باشد.
broader: تیر
preferred label: multispan beam @en
type: Concept