تیر منشوری
alternative label: تیر مقطع‌ثابت
scope note: تیری منشوری‌شکل که مقطع آن در طول ثابت باشد.
broader: تیر
preferred label: prismatic beam @en
type: Concept

تیر
preferred label: beam @en
type: Concept
narrower: تیر منشوری