تیر
preferred label: beam @en
type: Concept
narrower: تیر محیطی

تیر محیطی
scope note: تیر بیرونی در یک سازۀ فولادی یا بتنی که بین دو طبقه قرار گیرد.
broader: تیر
preferred label: spandrel beam @en
type: Concept