تیر
preferred label: beam @en
type: Concept
narrower: تیر خرپایی

خیز
preferred label: deflection (structure) @en
type: Concept
related: تیر خرپایی

تیر خرپایی
scope note: تیری که با استفاده از میله‌های مهاری فولادی تقویت می‌شود تا خیز (deflection) آن کاهش یابد.
related: خیز
broader: تیر
preferred label: trussed beam @en
type: Concept