تیر و شاه‌تیر چندلا
scope note: تیری که از لایه‌های چوبی و فلزی ساخته شده باشد.
broader: تیر و شاه‌تیر
preferred label: flitch beam and girder @en
type: Concept

تیر و شاه‌تیر
preferred label: beam and girder @en
type: Concept
narrower: تیر و شاه‌تیر چندلا